�S���n�������c�̃R�[�h,ID,����,����_�J�i,����_�p��,���ݒn_�S���n�������c�̃R�[�h,����ID,���ݒn_�A���\�L,���ݒn_�s���{��,���ݒn_�s�撬��,���ݒn_����,���ݒn_�Ԓn�ȉ�,��������(����),�ܓx,�o�x,�W��,�d�b�ԍ�,�����ԍ�,�A���惁�[���A�h���X,�A����FormURL,�A������l�i���̑��ASNS�Ȃǁj,�X�֔ԍ�,�s�撬���R�[�h,�n�������c�̖�,�ЊQ���_�^��,�ЊQ���_�R����A�y�Η��y�ђn����,�ЊQ���_����,�ЊQ���_�n�k,�ЊQ���_�Ôg,�ЊQ���_��K�͂ȉΎ�,�ЊQ���_�����×�,�ЊQ���_�ΎR����,�w����Ƃ̏d��,�z����e�l��,�ΏۂƂȂ钬��E������,URL,�摜,�摜_���C�Z���X,���l
131024,1.31024E+11,�铌���w�Z,�W���E�g�E�V���E�K�b�R�E,,131024,,�����s�����攪�d�F2-2-1,,,,,,35.679059,139.769114,,(03)3561-6340,,,,,1040028,131024,������,1,,1,1,,,1,,1,"2,480�l(3.3�u������4�l)",,,,,
131024,1.31024E+11,�����v���U,�L���E�o�V�v���U,,131024,,�����s��������1-25-3,,,,,,35.673121,139.771593,,(03)3561-5163,,,,,1040061,131024,������,1,,1,1,,,1,,1,"1,038�l(3.3�u������4�l)",,,,,
131024,1.31024E+11,�ז����w�Z,�^�C���C�V���E�K�b�R�E,,131024,,�����s��������5-1-13,,,,,,35.672383,139.761495,,(03)3571-1765,,,,,1040061,131024,������,1,,1,1,,,1,,1,"2,384�l(3.3�u������4�l)",,,,,
131024,1.31024E+11,������w�Z,�M���U�`���E�K�b�R�E,,131024,,�����s��������8-19-15,,,,,,35.665512,139.764854,,(03)3545-8011,,,,,1040061,131024,������,1,,1,1,,,1,,1,"4,590�l(3.3�u������4�l)",,,,,
131024,1.31024E+11,�������w�Z,�`���E�I�E�V���E�K�b�R�E,,131024,,�����s�����斩1-4-1,,,,,,35.672171,139.77876,,(03)3551-0565,,,,,1040043,131024,������,1,,1,1,,,1,,1,"2,940�l(3.3�u������4�l)",,,,,
131024,1.31024E+11,���Ώ��w�Z,�A�J�V�V���E�K�b�R�E,,131024,,�����s�����斾�Β�1-15,,,,,,35.668734,139.776472,,(03)3541-8335,,,,,1040044,131024,������,1,,1,1,,,1,,1,"3,903�l(3.3�u������4�l)",,,,,
131024,1.31024E+11,�����z�n���w�Z,�L���E�o�V�c�L�W�V���E�K�b�R�E,,131024,,�����s������z�n2-13-1,,,,,,35.667975,139.771173,,(03)3541-0642,,,,,1040045,131024,������,1,,1,1,,,1,,1,"3,397�l(3.3�u������4�l)",,,,,
131024,1.31024E+11,���؃X�N�G�A,�L���E�J�X�N�G�A,,131024,,�����s�����攪���x3-17-9,,,,,,35.674999,139.775575,,(03)3546-5487,,,,,1040032,131024,������,1,,1,1,,,1,,1,"2,460�l(3.3�u������4�l)",,,,,
131024,1.31024E+11,�������w�Z,���C�V���E�V���E�K�b�R�E,,131024,,�����s������V��2-13-4,,,,,,35.676011,139.781852,,(03)3551-5812,,,,,1040033,131024,������,1,,1,1,,,1,,1,"5,200�l(3.3�u������4�l)",,,,,
131024,1.31024E+11,��Տ��w�Z,�g�L���V���E�K�b�R�E,,131024,,�����s��������{���{�Β�4-4-26,,,,,,35.688038,139.770509,,(03)3241-1910,,,,,1030021,131024,������,1,,1,1,,,1,,1,"1,749�l(3.3�u������4�l)",,,,,
131024,1.31024E+11,�\�v�X�N�G�A,�W�b�V�X�N�G�A,,131024,,�����s��������{�����`�n��5-1,,,,,,35.690907,139.776991,,(03)3666-4560,,,,,1030001,131024,������,1,,1,1,,,1,,1,"1,332�l(3.3�u������4�l)",,,,,
131024,1.31024E+11,���{�����w�Z,�j�z���o�V�V���E�K�b�R�E,,131024,,�����s��������{���l�`��1-1-17,,,,,,35.684273,139.78123,,(03)3668-2361,,,,,1030013,131024,������,1,,1,1,,,1,,1,"3,120�l(3.3�u������4�l)",,,,,
131024,1.31024E+11,�L�n���w�Z,�A���}�V���E�K�b�R�E,,131024,,�����s��������{���a�k��2-10-23,,,,,,35.683219,139.787989,,(03)3666-5702,,,,,1030014,131024,������,1,,1,1,,,1,,1,"4,075�l(3.3�u������4�l)",,,,,
131024,1.31024E+11,�v�����w�Z,�q�T�}�c�V���E�K�b�R�E,,131024,,�����s��������{���v����7-2,,,,,,35.689056,139.784355,,(03)3661-6016,,,,,1030005,131024,������,1,,1,1,,,1,,1,"4,212�l(3.3�u������4�l)",,,,,
131024,1.31024E+11,���{�����w�Z,�j�z���o�V�`���E�K�b�R�E,,131024,,�����s�����擌���{��1-10-1,,,,,,35.691933,139.786993,,(03)3851-4883,,,,,1030004,131024,������,1,,1,1,,,1,,1,"4,176�l(3.3�u������4�l)",,,,,
131024,1.31024E+11,��{���w�Z,�T�J���g�V���E�K�b�R�E,,131024,,�����s��������{������15-18,,,,,,35.679538,139.776687,,(03)3666-0044,,,,,1030026,131024,������,1,,1,1,,,1,,1,"2,987�l(3.3�u������4�l)",,,,,
131024,1.31024E+11,�ϓ����w�Z,�c�N�_�W�}�V���E�K�b�R�E,,131024,,�����s�������2-3-1,,,,,,35.668599,139.784518,,(03)3531-7208,,,,,1040051,131024,������,1,,1,1,1,,1,,1,"4,509�l(3.3�u������4�l)",,,,,
131024,1.31024E+11,�ϒ��w�Z,�c�N�_�`���E�K�b�R�E,,131024,,�����s�������2-3-2,,,,,,35.667941,139.785025,,(03)3531-7214,,,,,1040051,131024,������,1,,1,1,1,,1,,1,"4,890�l(3.3�u������4�l)",,,,,
131024,1.31024E+11,������ꏬ�w�Z,�c�L�V�}�_�C�C�`�V���E�K�b�R�E,,131024,,�����s�����挎��4-15-1,,,,,,35.660674,139.780093,,(03)3531-7285,,,,,1040052,131024,������,1,,1,1,1,,1,,1,"3,504�l(3.3�u������4�l)",,,,,
131024,1.31024E+11,������񏬊w�Z,�c�L�V�}�_�C�j�V���E�K�b�R�E,,131024,,�����s�����揟�ǂ�1-12-2,,,,,,35.66017,139.775931,,(03)3531-7268,,,,,1040054,131024,������,1,,1,1,1,,1,,1,"3,837�l(3.3�u������4�l)",,,,,
131024,1.31024E+11,������O���w�Z,�c�L�V�}�_�C�T���V���E�K�b�R�E,,131024,,�����s�����搰�C1-4-1,,,,,,35.658848,139.785703,,(03)3531-7225,,,,,1040053,131024,������,1,,1,1,,,1,,1,"4,529�l(3.3�u������4�l)",,,,,
131024,1.31024E+11,���C���w�Z,�n���~�`���E�K�b�R�E,,131024,,�����s�����搰�C1-5-3,,,,,,35.659743,139.784908,,(03)3531-6308,,,,,1040053,131024,������,1,,1,1,,,1,,1,"4,401�l(3.3�u������4�l)",,,,,
131024,1.31024E+11,�L�C���w�Z,�g���~�V���E�K�b�R�E,,131024,,�����s�����揟�ǂ�6-6-2,,,,,,35.654366,139.773051,,(03)3534-1251,,,,,1040054,131024,������,1,,1,1,1,,1,,1,"5,612�l(3.3�u������4�l)",,,,,
131024,1.31024E+11,���������,�`���E�I�E�N���N�V��,,131024,,�����s������z�n1-1-1,,,,,,35.670599,139.77201,,(03)3543-0211,,,,,1040045,131024,������,1,,1,,,,1,,,,,,,,
131024,1.31024E+11,���{���斯�Z���^�[,�j�z���o�V�N�~���Z���^�[,,131024,,�����s��������{���a�k��1-31-1,,,,,,35.682479,139.784287,,(03)3666-4251,,,,,1030014,131024,������,1,,1,,,,1,,,579�l(3.3�u������4�l),,,,,
131024,1.31024E+11,�����斯�Z���^�[,�c�L�V�}�N�~���Z���^�[,,131024,,�����s�����挎��4-1-1,,,,,,35.661921,139.78192,,(03)3531-1151,,,,,1040052,131024,������,1,,1,,1,,1,,,"2,026�l(3.3�u������4�l)",,,,,
131024,1.31024E+11,(��)�ق��ƃv���U�͂��,�i�L���E�j�z�b�g�v���U�n���~,,131024,,�����s�����搰�C5-2-3,,,,,,35.652023,139.774843,,,,,,,1040053,131024,������,1,,1,1,,,1,,1,479�l(3.3�u������4�l),,,,,
131024,1.31024E+11,�������������,�A�J�c�L�R�E�G���C�b�^�C,,131024,,�����s������z�n�G�����斾�Β�,,,,,,35.665155,139.770788,,,,,,,1040045,131024,������,,,,,,1,,,,"9,895�l",,,,,
131024,1.31024E+11,�V��c�C���r���n��,�V���J���c�C���r���`�N,,131024,,�����s������V��,,,,,,35.677069,139.782438,,,,,,,1040033,131024,������,,,,,,1,,,,"30,650�l",,,,,
131024,1.31024E+11,�σ��o�[�V�e�B�n��,�c�N�_���o�[�V�e�B�`�N,,131024,,�����s�������,,,,,,35.666185,139.784641,,,,,,,1040051,131024,������,,,,,,1,,,,"22,208�l",,,,,
131024,1.31024E+11,���C�n��,�n���~�`�N,,131024,,�����s�����搰�C,,,,,,35.653904,139.780439,,,,,,,1040053,131024,������,,,,,,1,,,,"48,529�l",,,,,
