�S���n�������c�̃R�[�h,ID,�n�������c�̖�,����,����_�J�i,����_�p��,��Ë@�ւ̎��,���ݒn_�S���n�������c�̃R�[�h,����ID,���ݒn_�A���\�L,���ݒn_�s���{��,���ݒn_�s�撬��,���ݒn_����,���ݒn_�Ԓn�ȉ�,��������(����),�ܓx,�o�x,���x�̎��,���x�̒l,�d�b�ԍ�,�����ԍ�,FAX�ԍ�,�A���惁�[���A�h���X,�A����FormURL,�A������l�i���̑��ASNS�Ȃǁj,�X�֔ԍ�,�@�l�ԍ�,�@�l�̖���,��Ë@�փR�[�h,�f�×j��,�f�ÊJ�n����,�f�ÏI������,�f�Ó������L����,���ԊO�ɂ�����Ή�,�f�ÉȖ�,�a����,�ЊQ���_����,��,URL,�摜,�摜_���C�Z���X,���l
131024,1.31025E+11,������,��Ö@�l�Вc�I���� ���d�F�哇���,,,��ʐf�Ï�,131024,,�����s�����攪�d�F�񒚖�1 ���d�F�n���X��1��,,,,,,35.679907,139.769437,,,(03)6262-3996,,,,,,1040028,,,,,,,,,���,,,,,,,
131024,1.31025E+11,������,���d�F��������,,,��ʐf�Ï�,131024,,�����s�����攪�d�F�񒚖�4-11���d�Fh�{�r��2�K,,,,,,35.67806,139.769142,,,(03)6262-6380,,,,,,1040028,,,,,,,,,���,,,,,,,
131024,1.31025E+11,������,��Ö@�l�Вc �����l�h�s �����l�h�s�N���j�b�N,,,��ʐf�Ï�,131024,,�����s�����攪�d�F�񒚖�5-6KBY�r��3�K,,,,,,35.677966,139.768808,,,,,,,,,1040028,,,,,,,,,��ᇓ���,,,,,,,
131024,1.31025E+11,������,�����w�O�N���j�b�N,,,��ʐf�Ï�,131024,,�����s�����攪�d�F�񒚖�6-5���d�F�܂̌܃r��5�K,,,,,,35.677744,139.76853,,,,,,,,,1040028,,,,,,,,,�A�����M�[��;�畆��,,,,,,,
131024,1.31025E+11,������,�Q�[�e�����Y�N���j�b�N���d�F�@,,,��ʐf�Ï�,131024,,�����s�����攪�d�F�񒚖�6-21-4�K,,,,,,35.677882,139.767837,,,,,,,,,1040028,,,,,,,,,��A���;�������Ǔ���,,,,,,,
131024,1.31025E+11,������,�w���X�E�}�l�W�����g�E�N���j�b�N,,,��ʐf�Ï�,131024,,�����s�����攪�d�F�񒚖�11-2��Ӌ��r��1�K,,,,,,35.675833,139.766757,,,(03)6271-8971,,,,,,1040028,,,,,,,,,����,,,,,,,
131024,1.31025E+11,������,���d�F����,,,��ʐf�Ï�,131024,,�����s�����攪�d�F�񒚖�11-7��V�r��1�K,,,,,,35.675594,139.767518,,,(03)3281-1561,,,,,,1040028,,,,,,,,,����;�畆��;��A���,,,,,,,
131024,1.31025E+11,������,��Ö@�l�Вc���F�� �h�l�r �l���|�k�������N���j�b�N����,,,��ʐf�Ï�,131024,,�����s�����拞���꒚��1-5�Z���g�����r��7�K,,,,,,35.679208,139.770951,,,(03)3548-2451,,,,,,1040031,,,,,,,,,����;�������,,,,,,,
131024,1.31025E+11,������,��Ö@�l�Вc������ �������d�F�N���j�b�N,,,��ʐf�Ï�,131024,,�����s�����拞���꒚��1-6�z�O���r��2�K,,,,,,35.679181,139.771201,,,(03)6202-9080,,,,,,1040031,,,,,,,,,���E�}�`��;�y�C���N���j�b�N����;����;���`�O��;��A���;���_��;�S�Ó���;�w�l��;��������,,,,,,,
131024,1.31025E+11,������,��Ö@�l�Вc���a�� ���a�N���j�b�N,,,��ʐf�Ï�,131024,,�����s�����拞���꒚��1-6�z�O���r��3�K,,,,,,35.679181,139.771201,,,(03)6262-3751,,,,,,1040031,,,,,,,,,����;���;�畆��,,,,,,,
131024,1.31025E+11,������,���������N���j�b�N,,,��ʐf�Ï�,131024,,�����s�����拞���꒚��1-9LEO���d�F�r��2�K,,,,,,35.679048,139.771153,,,,,,,,,1040031,,,,,,,,,���e�O��;�w�l��;�`���O��;�畆��;��A���,,,,,,,
131024,1.31025E+11,������,�q���N���j�b�N�����w�O�@,,,��ʐf�Ï�,131024,,�����s�����拞���꒚��1-9LEO���d�F�r��8�K,,,,,,35.679048,139.771153,,,(03)6665-0622,,,,,,1040031,,,,,,,,,�Տ�������,,,,,,,
131024,1.31025E+11,������,�����X�e�[�V�����N���j�b�N,,,��ʐf�Ï�,131024,,�����s�����拞���꒚��1-9���I���d�F�r��5�K,,,,,,35.679048,139.771153,,,(03)6303-6511,,,,,,1040031,,,,,,,,,����;�畆��;��A���,,,,,,,
131024,1.31025E+11,������,�A�Q�C�����f�B�J���N���j�b�N,,,��ʐf�Ï�,131024,,�����s�����拞���꒚��1-10�����{�X�r��5�K,,,,,,35.678968,139.771195,,,,,,,,,1040031,,,,,,,,,�`���O��;���e�O��;���e�畆��,,,,,,,
131024,1.31025E+11,������,���������^���N���j�b�N,,,��ʐf�Ï�,131024,,�����s�����拞���꒚��2-4���d�F�m���I�r��9�K,,,,,,35.679001,139.770568,,,(03)5203-1930,,,,,,1040031,,,,,,,,,���_��,,,,,,,
131024,1.31025E+11,������,�@�̃N���j�b�N����,,,��ʐf�Ï�,131024,,�����s�����拞���꒚��3-1���d�F����h�r��3�K�E4�K,,,,,,35.678739,139.771015,,,,,,,,,1040031,,,,,,,,,���@��A��;������;�ċz�����,,,,,,,
131024,1.31025E+11,������,��Ö@�l�Вc�a�n�g �ז�N���j�b�N,,,��ʐf�Ï�,131024,,�����s�����拞���꒚��6-11�J���P�������r��2�K,,,,,,35.677415,139.772112,,,(03)3563-0577,,,,,,1040031,,,,,,,,,����;�畆��;���`�O��;���n�r���e�[�V������,,,,,,,
131024,1.31025E+11,������,�ċz�P�A�N���j�b�N����,,,��ʐf�Ï�,131024,,�����s�����拞���꒚��12-5����YS�r��1�K,,,,,,35.677934,139.773017,,,,,,,,,1040031,,,,,,,,,�ċz�����;����;�A�����M�[��,,,,,,,
131024,1.31025E+11,������,�r���@,,,��ʐf�Ï�,131024,,�����s�����拞���񒚖�1-1,,,,,,35.678137,139.769556,,,,,,,,,1040031,,,,,,,,,����,,,,,,,
131024,1.31025E+11,������,��Ö@�l�Вc�����] �����A�X�{�N���j�b�N,,,��ʐf�Ï�,131024,,�����s�����拞���񒚖�2-1�����G�h�O����24�K,,,,,,35.677019,139.769831,,,,,,,,,1040031,,,,,,,,,����;�Y�w�l��;���`�O��;���B�O��;���������;�畆��;�z�����;�������ӓ���;�t������;�]�_�o����;���A�a����,,,,,,,
131024,1.31025E+11,������,�{����Ȉ�@,,,��ʐf�Ï�,131024,,�����s�����拞���񒚖�5-18�����n����3F,,,,,,35.67628,139.770235,,,,,,,,,1040031,,,,,,,,,���,,,,,,,
131024,1.31025E+11,������,��Ö@�l�Вc����� �����N���j�b�N,,,��ʐf�Ï�,131024,,�����s�����拞���񒚖�5-22�L�������r��1�K�A2�K�A4�K,,,,,,35.676475,139.770225,,,(03)3563-5011,,,,,,1040031,,,,,,,,,����;�A�����M�[��;�O��;�ċz�����;�z�����;�w�l��;���������,,,,,,,
131024,1.31025E+11,������,����N���j�b�N,,,��ʐf�Ï�,131024,,�����s�����拞���񒚖�6-6���؃r��2�K,,,,,,35.676614,139.771217,,,(03)3538-6055,,,,,,1040031,,,,,,,,,���_��;�S�Ó���,,,,,,,
131024,1.31025E+11,������,���d�F�Z���N���j�b�N,,,��ʐf�Ï�,131024,,�����s�����拞���񒚖�6-16�G�^�[�i���r��4�K,,,,,,35.67657,139.770787,,,(03)6264-4415,,,,,,1040031,,,,,,,,,����;�Y�w�l��,,,,,,,
131024,1.31025E+11,������,��Ö@�l���c������ �h�l�r �l���|�k�������N���j�b�N���d�F,,,��ʐf�Ï�,131024,,�����s�����拞���񒚖�7-19�����C�[�X�g�r��5�K,,,,,,35.677084,139.770804,,,(03)3567-2080,,,,,,1040031,,,,,,,,,����;�w�l��;���������,,,,,,,
131024,1.31025E+11,������,��Ö@�l���c�}�K�� ���c�f�Ï�,,,��ʐf�Ï�,131024,,�����s�����拞���񒚖�8-16,,,,,,35.677197,139.771158,,,,,,,,,1040031,,,,,,,,,����;����;��������,,,,,,,
131024,1.31025E+11,������,�������`�O��,,,��ʐf�Ï�,131024,,�����s�����拞���񒚖�8-21��v�ƃr��3�K,,,,,,35.677458,139.770841,,,,,,,,,1040031,,,,,,,,,���`�O��;���n�r���e�[�V������;���E�}�`��,,,,,,,
131024,1.31025E+11,������,�㓡�畆�ȃN���j�b�N,,,��ʐf�Ï�,131024,,�����s�����拞���񒚖�8-21���a�r���ʊ�2�K,,,,,,35.677458,139.770841,,,(03)3562-2560,,,,,,1040031,,,,,,,,,�畆��,,,,,,,
131024,1.31025E+11,������,�E�F���G�C�W���O���� �z��N���j�b�N,,,��ʐf�Ï�,131024,,�����s�����拞���񒚖�8-21���a�r���ʊ�3�K,,,,,,35.677458,139.770841,,,(03)3564-1511,,,,,,1040031,,,,,,,,,�z�����,,,,,,,
131024,1.31025E+11,������,�������Ȉ�@,,,��ʐf�Ï�,131024,,�����s�����拞���񒚖�8-21���a�r���ʊ�4�K,,,,,,35.677458,139.770841,,,(03)3567-8311,,,,,,1040031,,,,,,,,,����,,,,,,,
131024,1.31025E+11,������,���{���ȉ@,,,��ʐf�Ï�,131024,,�����s�����拞���񒚖�11-5�p�C���Z���g�����r��5�K,,,,,,35.676235,139.77194,,,(03)3561-0223,,,,,,1040031,,,,,,,,,����,,,,,,,
131024,1.31025E+11,������,�����,,,��ʐf�Ï�,131024,,�����s�����拞���񒚖�11-11��i�r��202,,,,,,35.676287,139.77167,,,(03)3535-3570,,,,,,1040031,,,,,,,,,���,,,,,,,
131024,1.31025E+11,������,��Ö@�l�Вc �Q�p�� �⍲���@��A��,,,��ʐf�Ï�,131024,,�����s�����拞���񒚖�12-4���a�r��2�K,,,,,,35.67586,139.771783,,,(03)3567-8733,,,,,,1040031,,,,,,,,,���@��A��,,,,,,,
131024,1.31025E+11,������,���f�B�J���N���j�b�N���i����,,,��ʐf�Ï�,131024,,�����s�����拞���񒚖�12-9����r��6�K,,,,,,35.675765,139.771311,,,(03)3528-6822,,,,,,1040031,,,,,,,,,���_��;�S�Ó���,,,,,,,
131024,1.31025E+11,������,��Ö@�l�S�ԉ�T�c�����N���j�b�N,,,��ʐf�Ï�,131024,,�����s�����拞���O����1-1�����X�N�G�A�K�[�f��4�K�E6�K,,,,,,35.676025,139.768762,,,,,,,,,1040031,,,,,,,,,����;��ᇓ���;�z�����;�����Ǔ���;���A�a����;���@���񂱂���;�w�l��;���B�O��;�O��;�S�����ǊO��;�]�_�o�O��;���`�O��;��A���;���ː���;���Ȍ��o�O��;�t������;�ċz�����;�ċz��O��;���������;������O��;�`���E���e�O��;�a���f�f��,,,,,,,
131024,1.31025E+11,������,�t�@�C���[�N���j�b�N����@,,,��ʐf�Ï�,131024,,�����s�����拞���O����3-11VORT����4�K,,,,,,35.675597,139.768313,,,(03)6262-3411,,,,,,1040031,,,,,,,,,�畆��;���e�畆��;����;���_��,,,,,,,
131024,1.31025E+11,������,���ǎɋ���N���j�b�N,,,��ʐf�Ï�,131024,,�����s�����拞���O����3-14����AK�r��7�K,,,,,,35.675646,139.767942,,,(03)6228-6763,,,,,,1040031,,,,,,,,,����,,,,,,,
131024,1.31025E+11,������,��Ö@�l�Вc���������ݒ��N���j�b�N,,,��ʐf�Ï�,131024,,�����s�����拞���O����4-2�t�H�[�`�����r��2�K,,,,,,35.675351,139.768445,,,(03)5205-8666,,,,,,1040031,,,,,,,,,����;���������,,,,,,,
131024,1.31025E+11,������,���݊كN���j�b�N,,,��ʐf�Ï�,131024,,�����s�����拞���O����6-1�H�t�r��4�K,,,,,,35.675582,139.76962,,,(03)3567-8077,,,,,,1040031,,,,,,,,,����,,,,,,,
131024,1.31025E+11,������,���f�B�J���`�F�b�N�X�^�W�I��������N���j�b�N,,,��ʐf�Ï�,131024,,�����s���������꒚��2-42�K,,,,,,35.675407,139.767436,,,,,,,,,1040061,,,,,,,,,�S�����Ǔ���;�]�_�o����,,,,,,,
131024,1.31025E+11,������,��Ö@�l�I���� ����������f�B�J���N���j�b�N,,,��ʐf�Ï�,131024,,�����s���������꒚��2-4�T�N�Z�X����t�@�[�X�g�r��12�K�E13�K,,,,,,35.674963,139.768665,,,(03)3535-1555,,,,,,1040061,,,,,,,,,����;�畆��;���e�畆��,,,,,,,
131024,1.31025E+11,������,�s�g�d �r�s�n�q�x �b�k�h�m�h�b,,,��ʐf�Ï�,131024,,�����s���������꒚��2-4�T�N�Z�X����t�@�[�X�g�r��7�K�A11�K,,,,,,35.674963,139.768665,,,(03)5579-5602,,,,,,1040061,,,,,,,,,���e�畆��;�畆��,,,,,,,
131024,1.31025E+11,������,��Ö@�l�Вc�L�`�� �q�c�N���j�b�N�������,,,��ʐf�Ï�,131024,,�����s���������꒚��3-1����x�m���r��9�K,,,,,,35.675374,139.766203,,,,,,,,,1040061,,,,,,,,,�畆��,,,,,,,
131024,1.31025E+11,������,��Ö@�l�Вc���������P�C�X�L���N���j�b�N,,,��ʐf�Ï�,131024,,�����s���������꒚��3-3G1�r��5�K�E6�K,,,,,,35.675311,139.766546,,,(03)6228-8020,,,,,,1040061,,,,,,,,,���e�畆��;�畆��,,,,,,,
131024,1.31025E+11,������,�Ó���e�N���j�b�N����@,,,��ʐf�Ï�,131024,,�����s���������꒚��3-9�}���C�g����r��2�K,,,,,,35.675152,139.766203,,,(0120)049-055,,,,,,1040061,,,,,,,,,���e�畆��;���e�O��,,,,,,,
131024,1.31025E+11,������,�i����e�O�ȋ���@,,,��ʐf�Ï�,131024,,�����s���������꒚��3-9�}���C�g����r��3�K,,,,,,35.675152,139.766203,,,(03)5579-9693,,,,,,1040061,,,,,,,,,���e�O��;���e�畆��,,,,,,,
131024,1.31025E+11,������,�i��X�L���N���j�b�N����@,,,��ʐf�Ï�,131024,,�����s���������꒚��3-9�}���C�g����r��4�K,,,,,,35.675152,139.766203,,,(03)5579-9694,,,,,,1040061,,,,,,,,,���e�畆��;���e�O��,,,,,,,
131024,1.31025E+11,������,��������̂Ƃ背�f�B�[�X�N���j�b�N,,,��ʐf�Ï�,131024,,�����s���������꒚��3-9�}���C�g����r��7�K,,,,,,35.675152,139.766203,,,(03)5159-2077,,,,,,1040061,,,,,,,,,�Y�w�l�ȁi�s�D���Áj,,,,,,,
131024,1.31025E+11,������,��Ö@�l�Вc�t�F���I�X �������A���p�N���j�b�N,,,��ʐf�Ï�,131024,,�����s���������꒚��3-9�}���C�g����r��8�K,,,,,,35.675152,139.766203,,,(03)3567-2555,,,,,,1040061,,,,,,,,,���;���`�O��;�`���O��,,,,,,,
131024,1.31025E+11,������,��Ö@�l�Вc �O�K�� ����t�F�~�[�N���j�b�N,,,��ʐf�Ï�,131024,,�����s���������꒚��3-13TheORBPremiere3�K,,,,,,35.675285,139.766199,,,(03)5584-3811,,,,,,1040061,,,,,,,,,���e�O��;���e�畆��,,,,,,,
131024,1.31025E+11,������,�d�n�k �b�k�h�m�h�b,,,��ʐf�Ï�,131024,,�����s���������꒚��4-4�M���U105�r��6�K,,,,,,35.675047,139.766903,,,(03)3528-6801,,,,,,1040061,,,,,,,,,���e�畆��;�畆��,,,,,,,
131024,1.31025E+11,������,��Ö@�l�Вc�r�l�h�k�d �k�`�m�c �a�h�`�m�b�` �b�k�h�m�h�b,,,��ʐf�Ï�,131024,,�����s���������꒚��5-6��������K�ʂ蕟�_�r��4�K�A6�K,,,,,,35.674806,139.767319,,,,,,,,,1040061,,,,,,,,,�畆��;�`���O��;���e�O��;���e�畆��,,,,,,,
131024,1.31025E+11,������,��Ö@�l�Вc�t�������E�͂�˃N���j�b�N���,,,��ʐf�Ï�,131024,,�����s���������꒚��5-8�M���U�E�B���[�A���F�j���[�r��6�K,,,,,,35.674556,139.767092,,,(03)5250-6850,,,,,,1040061,,,,,,,,,�Y��;�w�l��,,,,,,,
131024,1.31025E+11,������,����\�����A�N���j�b�N,,,��ʐf�Ï�,131024,,�����s���������꒚��5-8����E�B���[�A�x�j���[�r��5�K,,,,,,35.674556,139.767092,,,(03)5524-1850,,,,,,1040061,,,,,,,,,�`���O��;���e�畆��;����;���`�O��;��A���,,,,,,,
131024,1.31025E+11,������,�A�[���C�[�N���j�b�N���,,,��ʐf�Ï�,131024,,�����s���������꒚��5-8����E�B���[�A�x�j���[�r��8�K,,,,,,35.674556,139.767092,,,(03)3528-6788,,,,,,1040061,,,,,,,,,����;��A���;���`�O��;���e�畆��,,,,,,,
131024,1.31025E+11,������,��Ö@�l�Вc ���� �A��f�Î�,,,��ʐf�Ï�,131024,,�����s���������꒚��5-12����N���X�^���^���[8�K,,,,,,35.674633,139.766834,,,,,,,,,1040061,,,,,,,,,����;����;��������,,,,,,,
131024,1.31025E+11,������,�c�l�s�b���e�畆�� ����@,,,��ʐf�Ï�,131024,,�����s���������꒚��5-13�[�b�g�G�b�N�X����r��4�K,,,,,,35.674721,139.766931,,,(03)5579-5962,,,,,,1040061,,,,,,,,,����;�畆��;���e�畆��,,,,,,,
131024,1.31025E+11,������,�t�@�[�X�g�r���[�e�B�N���j�b�N,,,��ʐf�Ï�,131024,,�����s���������꒚��6-1����N���b�Z���g�r��6�K,,,,,,35.674883,139.76782,,,(03)3538-9111,,,,,,1040061,,,,,,,,,���e�O��;�`���O��,,,,,,,
131024,1.31025E+11,������,��������X�L���P�A�N���j�b�N,,,��ʐf�Ï�,131024,,�����s���������꒚��6-8DEARGINZA6�K,,,,,,35.674382,139.767433,,,(03)6264-4871,,,,,,1040061,,,,,,,,,�`���O��;�畆��;���e�畆��,,,,,,,
131024,1.31025E+11,������,�n�������������� �a���������� �b���������� �f�h�m�y�`,,,��ʐf�Ï�,131024,,�����s���������꒚��6-8DEARGINZA�r��4�K,,,,,,35.674382,139.767433,,,(03)6271-0923,,,,,,1040061,,,,,,,,,���e�O��;���e�畆��;�畆��,,,,,,,
131024,1.31025E+11,������,��Ö@�l�Вc�D��� �L�y���畆��,,,��ʐf�Ï�,131024,,�����s���������꒚��6-10���r���f�B���O6�K,,,,,,35.674297,139.767355,,,(0120)353-908,,,,,,1040061,,,,,,,,,�畆��;���e�畆��;�`���O��;���e�O��,,,,,,,
131024,1.31025E+11,������,�E�B���r�[�N���j�b�N,,,��ʐf�Ï�,131024,,�����s���������꒚��6-11�y�u�c�r��6�K,,,,,,35.674412,139.767235,,,,,,,,,1040061,,,,,,,,,���e�畆��,,,,,,,
131024,1.31025E+11,������,�o�d�q�r�n�m�`�k �a�d�`�t�s�x �b�k�h�m�h�b �s�n�j�x�n,,,��ʐf�Ï�,131024,,�����s���������꒚��6-11�y�u�c�r���a���O2�K,,,,,,35.674412,139.767235,,,(03)6264-4800,,,,,,1040061,,,,,,,,,���e�O��;���e�畆��,,,,,,,
131024,1.31025E+11,������,�A���V�A�N���j�b�N����@,,,��ʐf�Ï�,131024,,�����s���������꒚��6-11�y�u�c�r���f�B���O4�K,,,,,,35.674412,139.767235,,,,,,,,,1040061,,,,,,,,,�畆��;�`���O��,,,,,,,
131024,1.31025E+11,������,��Ö@�l�Вc���� ��׎��@��A��,,,��ʐf�Ï�,131024,,�����s���������꒚��6-13-106GINZABLD4�K,,,,,,35.674506,139.767345,,,(03)3538-6366,,,,,,1040061,,,,,,,,,���@��A��;�A�����M�[��,,,,,,,
131024,1.31025E+11,������,�c���N���j�b�N���,,,��ʐf�Ï�,131024,,�����s���������꒚��6-13-106GINZABLDG3�K,,,,,,35.674506,139.767345,,,(03)3538-6460,,,,,,1040061,,,,,,,,,����;���_��;�_�o��;�S�Ó���;���e�畆��,,,,,,,
131024,1.31025E+11,������,��������K�ʂ�N���j�b�N,,,��ʐf�Ï�,131024,,�����s���������꒚��6-16���1616�r��4�K,,,,,,35.674775,139.767654,,,(03)3535-2280,,,,,,1040061,,,,,,,,,����;�S�Ó���;���_��,,,,,,,
131024,1.31025E+11,������,��������^���N���j�b�N,,,��ʐf�Ï�,131024,,�����s���������꒚��7-6�^�j�U���r��8�K,,,,,,35.674423,139.768069,,,(03)5250-4860,,,,,,1040061,,,,,,,,,���_��;�S�Ó���,,,,,,,
131024,1.31025E+11,������,��Ö@�l�Вc���� ����s�r�t�a�`�j�h�N���j�b�N,,,��ʐf�Ï�,131024,,�����s���������꒚��7-6����͍��r��3�K,,,,,,35.674423,139.768069,,,,,,,,,1040061,,,,,,,,,���e�畆��,,,,,,,
131024,1.31025E+11,������,���e�B�[�t����N���j�b�N,,,��ʐf�Ï�,131024,,�����s���������꒚��7-6����͍��r��4�K,,,,,,35.674423,139.768069,,,(03)3528-6877,,,,,,1040061,,,,,,,,,���e�O��;���e�畆��;�`���O��;�畆��,,,,,,,
131024,1.31025E+11,������,�����E�N���j�I�t�F�C�V�����E�N���j�b�N����,,,��ʐf�Ï�,131024,,�����s���������꒚��7-17�q���[���b�N���1���ڃK�X���ʂ�5�K,,,,,,35.674561,139.767988,,,(03)5524-1189,,,,,,1040061,,,,,,,,,�`���O��;���e�O��,,,,,,,
131024,1.31025E+11,������,��Ö@�l�Вc�G���G�t�V�[ ����t�@�C���P�A�N���j�b�N,,,��ʐf�Ï�,131024,,�����s���������꒚��8-14�����V�r��3�K4�K,,,,,,35.673738,139.768201,,,(0120)312-879,,,,,,1040061,,,,,,,,,����;�畆��;�`���O��;���e�O��,,,,,,,
131024,1.31025E+11,������,���O���������@,,,��ʐf�Ï�,131024,,�����s���������꒚��8-17�ɐ��Ƀr��6�K�A9�K,,,,,,35.674081,139.768358,,,(03)6228-6825,,,,,,1040061,,,,,,,,,���e�O��;���e�畆��;�`���O��;���`�O��,,,,,,,
131024,1.31025E+11,������,��Ö@�l�Вc������ ���{�N���j�b�N ����@,,,��ʐf�Ï�,131024,,�����s���������꒚��8-19�L�����g�M���U11�K,,,,,,35.674259,139.76867,,,,,,,,,1040061,,,,,,,,,���e�O��;�`���O��;���e�畆��;�畆��;��A���,,,,,,,
131024,1.31025E+11,������,������N���j�b�N,,,��ʐf�Ï�,131024,,�����s���������꒚��8-19�L�����g�M���U9�K,,,,,,35.674259,139.76867,,,(03)6680-8386,,,,,,1040061,,,,,,,,,�畆��;���e�畆��,,,,,,,
131024,1.31025E+11,������,�]����e�O�ȋ���@,,,��ʐf�Ï�,131024,,�����s���������꒚��8-19�L�����g���10�K,,,,,,35.674259,139.76867,,,,,,,,,1040061,,,,,,,,,���e�畆��,,,,,,,
131024,1.31025E+11,������,����꒚�ڃN���j�b�N,,,��ʐf�Ï�,131024,,�����s���������꒚��9-12���R���Ɠ�����r��6�K,,,,,,35.673473,139.768565,,,,,,,,,1040061,,,,,,,,,����;��ᇓ���;�w�l��,,,,,,,
131024,1.31025E+11,������,��Ö@�l�Вc����m��� �g���@,,,��ʐf�Ï�,131024,,�����s���������꒚��9-17,,,,,,35.673914,139.768706,,,(03)3561-4010,,,,,,1040061,,,,,,,,,����;�ݒ���;�O��;�畆��,,,,,,,
131024,1.31025E+11,������,�؃N���j�b�N,,,��ʐf�Ï�,131024,,�����s���������꒚��13-7�ؔ҃r���n��1�K,,,,,,35.673514,139.769473,,,(03)5250-0131,,,,,,1040061,,,,,,,,,������,,,,,,,
131024,1.31025E+11,������,��������E�F���l�X���G�C�W���O�N���j�b�N,,,��ʐf�Ï�,131024,,�����s���������꒚��14-4�v�����[����r��2�K�E5�K�E6�K,,,,,,35.673296,139.769935,,,,,,,,,1040061,,,,,,,,,����;��ᇓ���;�S�Ó���;���������;������O��;���`�O��;�`���O��;���ː���,,,,,,,
131024,1.31025E+11,������,�r��畆�Ȍ`���O�ȃN���j�b�N,,,��ʐf�Ï�,131024,,�����s���������꒚��14-4�v�����[����r��3�K,,,,,,35.673296,139.769935,,,(03)3538-1344,,,,,,1040061,,,,,,,,,�`���O��;���e�O��;�畆��,,,,,,,
131024,1.31025E+11,������,�S�����N���j�b�N ����@,,,��ʐf�Ï�,131024,,�����s���������꒚��14-4�v�����[����r��8�K,,,,,,35.673296,139.769935,,,,,,,,,1040061,,,,,,,,,���e�畆��,,,,,,,
131024,1.31025E+11,������,�G�t�F���[���z�[���N���j�b�N,,,��ʐf�Ï�,131024,,�����s���������꒚��14-5����E�C���O�r���k3�K,,,,,,35.673148,139.769853,,,,,,,,,1040061,,,,,,,,,����;���_��;�_�o����;�S�Ó���;���n�r���e�[�V������,,,,,,,
131024,1.31025E+11,������,�I�L�����t�F�C�V�����N���j�b�N����,,,��ʐf�Ï�,131024,,�����s���������꒚��15-4���1���ڃr��8�K,,,,,,35.673794,139.770414,,,(03)5579-9995,,,,,,1040061,,,,,,,,,���;�`���O��;���e�O��,,,,,,,
131024,1.31025E+11,������,�Z�����A�N���j�b�N���,,,��ʐf�Ï�,131024,,�����s���������꒚��15-4����꒚�ڃr��10�K,,,,,,35.673794,139.770414,,,,,,,,,1040061,,,,,,,,,����,,,,,,,
131024,1.31025E+11,������,����Z���g�����N���j�b�N,,,��ʐf�Ï�,131024,,�����s���������꒚��15-4����꒚�ڃr��5�K,,,,,,35.673794,139.770414,,,(03)5579-5995,,,,,,1040061,,,,,,,,,���������;������;����,,,,,,,
131024,1.31025E+11,������,��Ö@�l�Вc����L���[���H�N���j�b�N,,,��ʐf�Ï�,131024,,�����s���������꒚��16-1���݃r��1�K,,,,,,35.674276,139.770508,,,(03)5159-6126,,,,,,1040061,,,,,,,,,�`���O��;���e�O��;�畆��,,,,,,,
131024,1.31025E+11,������,�f�d�m�d�����N���j�b�N,,,��ʐf�Ï�,131024,,�����s���������꒚��18-2�C�r��3�K,,,,,,35.673902,139.771545,,,(03)6263-0775,,,,,,1040061,,,,,,,,,��ᇓ���,,,,,,,
131024,1.31025E+11,������,�����拞���x�����}�f�Ï�,,,��ʐf�Ï�,131024,,�����s���������꒚��25-3�����v���U2�K,,,,,,35.673121,139.771593,,,,,,,,,1040061,,,,,,,,,����;������,,,,,,,
131024,1.31025E+11,������,��������̐f�Ï�,,,��ʐf�Ï�,131024,,�����s���������񒚖�2-17�L�y���r��5�K,,,,,,35.674561,139.765556,,,(03)3535-0777,,,,,,1040061,,,,,,,,,�`���O��;�畆��;���e�畆��,,,,,,,
131024,1.31025E+11,������,��Ö@�l�Вc�O��� �L�y���N���j�b�N,,,��ʐf�Ï�,131024,,�����s���������񒚖�2-17���ی��r��4�K,,,,,,35.674561,139.765556,,,(03)3567-8788,,,,,,1040061,,,,,,,,,����;���������;�z�����;���A�a����;������ӓ���;�]�_�o����,,,,,,,
131024,1.31025E+11,������,�v�n�l �b�k�h�m�h�b �f�h�m�y�`,,,��ʐf�Ï�,131024,,�����s���������񒚖�2-18TH����r��3�K,,,,,,35.674681,139.765652,,,,,,,,,1040061,,,,,,,,,���e�E�`���O��,,,,,,,
131024,1.31025E+11,������,�v�n�l �b�k�h�m�h�b �f�h�m�y�` �{�@,,,��ʐf�Ï�,131024,,�����s���������񒚖�2-18TH����r��6�K7�K,,,,,,35.674681,139.765652,,,,,,,,,1040061,,,,,,,,,���e�E�`���O��,,,,,,,
131024,1.31025E+11,������,����s�`�b��������Ö�ᎃN���j�b�N,,,��ʐf�Ï�,131024,,�����s���������񒚖�3-1RayGinza5�K,,,,,,35.674715,139.766237,,,(03)6263-2916,,,,,,1040061,,,,,,,,,���e�O��;���e�畆��;���ǊO��;����,,,,,,,
131024,1.31025E+11,������,�q�d�u�h�N���j�b�N,,,��ʐf�Ï�,131024,,�����s���������񒚖�4-2�����r��7�K,,,,,,35.674304,139.766848,,,,,,,,,1040061,,,,,,,,,���e�畆��,,,,,,,
131024,1.31025E+11,������,��Ö@�l�Вc���m�� ����g�c��@,,,��ʐf�Ï�,131024,,�����s���������񒚖�4-8GINZAYUKIBLDG�D8�E9F,,,,,,35.673815,139.766249,,,(03)3561-5537,,,,,,1040061,,,,,,,,,�Y�w�l��;����,,,,,,,
131024,1.31025E+11,������,����b������������ �b����������,,,��ʐf�Ï�,131024,,�����s���������񒚖�4-8���YUKI�r��6�K,,,,,,35.673815,139.766249,,,,,,,,,1040061,,,,,,,,,���e�畆��,,,,,,,
131024,1.31025E+11,������,�G�k�r���[�e�B�[�N���j�b�N���,,,��ʐf�Ï�,131024,,�����s���������񒚖�4-18�A���{�[�����3�K,,,,,,35.674228,139.766579,,,,,,,,,1040061,,,,,,,,,���e�O��;���e�畆��,,,,,,,
131024,1.31025E+11,������,���E�o����������������N���j�b�N,,,��ʐf�Ï�,131024,,�����s���������񒚖�4-18�A���{�[�����3�KE��,,,,,,35.674228,139.766579,,,(03)3561-5201,,,,,,1040061,,,,,,,,,�`���O�ȁC���e�O�ȁC�畆�ȁC��A���,,,,,,,
131024,1.31025E+11,������,�s�g�h�q�c �b�k�h�m�h�b �f�h�m�y�`,,,��ʐf�Ï�,131024,,�����s���������񒚖�4-18�A���{�[�����4�KE��,,,,,,35.674228,139.766579,,,(03)6263-2231,,,,,,1040061,,,,,,,,,�Y�w�l��;����;������;���;���e�畆��,,,,,,,
131024,1.31025E+11,������,�q �r���[�e�B�[ �N���j�b�N,,,��ʐf�Ï�,131024,,�����s���������񒚖�4-18�A���{�[�����9�K,,,,,,35.674228,139.766579,,,,,,,,,1040061,,,,,,,,,���e�O��,,,,,,,
131024,1.31025E+11,������,�����E�N���j�I�t�F�C�V�����E�N���j�b�N���,,,��ʐf�Ï�,131024,,�����s���������񒚖�4-19����3�r��5�K,,,,,,35.674351,139.766557,,,(03)6228-7200,,,,,,1040061,,,,,,,,,�`���O��;���e�O��,,,,,,,
131024,1.31025E+11,������,�o�������� �b����������,,,��ʐf�Ï�,131024,,�����s���������񒚖�5-4�t�@�T�[�h���3�K,,,,,,35.673918,139.766998,,,(03)3538-7370,,,,,,1040061,,,,,,,,,���e�畆��,,,,,,,
131024,1.31025E+11,������,���̐X���e�O�� ����@,,,��ʐf�Ï�,131024,,�����s���������񒚖�5-4�t�@�T�[�h���4�K,,,,,,35.673918,139.766998,,,,,,,,,1040061,,,,,,,,,���e�O��;�`���O��,,,,,,,
131024,1.31025E+11,������,��ʎВc�@�l�k�n�b�g�h�b �k�n�b�g�h�b �b�k�h�m�h�b �f�h�m�y�`,,,��ʐf�Ï�,131024,,�����s���������񒚖�5-4�t�@�T�[�h���9�K,,,,,,35.673918,139.766998,,,,,,,,,1040061,,,,,,,,,���e�O��;�`���O��;���e�畆��,,,,,,,
131024,1.31025E+11,������,��Ö@�l�Вc�^����p���f�B�[�X�N���j�b�N,,,��ʐf�Ï�,131024,,�����s���������񒚖�5-11V88�r���f�B���O3�K�y��4�K,,,,,,35.673449,139.766458,,,(03)5159-1101,,,,,,1040061,,,,,,,,,�Y�w�l��,,,,,,,
131024,1.31025E+11,������,����悵���N���j�b�N����@,,,��ʐf�Ï�,131024,,�����s���������񒚖�5-11V88�r���f�B���O5�K,,,,,,35.673449,139.766458,,,(03)5579-5610,,,,,,1040061,,,,,,,,,�畆��;�`���O��;���e�畆��,,,,,,,
131024,1.31025E+11,������,�l������ �b����������,,,��ʐf�Ï�,131024,,�����s���������񒚖�5-11V88�r���f�B���O6�K�E7�K,,,,,,35.673449,139.766458,,,,,,,,,1040061,,,,,,,,,���e�O��,,,,,,,
131024,1.31025E+11,������,����b�o�b�N���j�b�N,,,��ʐf�Ï�,131024,,�����s���������񒚖�5-11V88�r���f�B���O8�K,,,,,,35.673449,139.766458,,,,,,,,,1040061,,,,,,,,,����;�`���O��;�畆��,,,,,,,
131024,1.31025E+11,������,�b������ ���� �f�q�`�b�h�` �f�h�m�y�`,,,��ʐf�Ï�,131024,,�����s���������񒚖�5-11V88�r���f�B���O9�K,,,,,,35.673449,139.766458,,,,,,,,,1040061,,,,,,,,,���e�O��;���e�畆��,,,,,,,
131024,1.31025E+11,������,�m�G������N���j�b�N,,,��ʐf�Ï�,131024,,�����s���������񒚖�5-14����}���j�G�r��7�K,,,,,,35.673594,139.766359,,,(0120)008-406,,,,,,1040061,,,,,,,,,���e�O��;���e�畆��,,,,,,,
131024,1.31025E+11,������,��Ö@�l�Вc�V�[�Y�E���f�B�J���V���m�N���j�b�N���,,,��ʐf�Ï�,131024,,�����s���������񒚖�6-4�|������r���f�B���O4�K,,,,,,35.673795,139.767319,,,(0120)997-474,,,,,,1040061,,,,,,,,,�畆��;�`���O��,,,,,,,
131024,1.31025E+11,������,��Ö@�l�Вc�v������ �e�������� �ɂ����N���j�b�N���,,,��ʐf�Ï�,131024,,�����s���������񒚖�6-5�A�T�R����r��7�K,,,,,,35.673645,139.767292,,,(03)3562-9205,,,,,,1040061,,,,,,,,,�O��;����;�畆��;�w�l��;���,,,,,,,
131024,1.31025E+11,������,�m�Q�N���j�b�N,,,��ʐf�Ï�,131024,,�����s���������񒚖�6-5����g���V���X3�K,,,,,,35.673645,139.767292,,,(03)3561-0222,,,,,,1040061,,,,,,,,,�`���O��;���e�O��;�畆��;���e�畆��;��ᇓ���;���`�O��,,,,,,,
131024,1.31025E+11,������,��Ö@�l�Вc�E�B�~���Y�E�E�F���l�X �Δn�����q�������C�t�N���j�b�N���,,,��ʐf�Ï�,131024,,�����s���������񒚖�6-5����g���V���X7�K,,,,,,35.673645,139.767292,,,(03)3538-0270,,,,,,1040061,,,,,,,,,�Y��;�w�l��;���B�O��;����;�S�Ó���;��A���;�畆��;������,�L��,,,,,,
131024,1.31025E+11,������,�s�b�a �����������e�O�� ����񒚖ډ@,,,��ʐf�Ï�,131024,,�����s���������񒚖�6-9Ginza269�r��9�K,,,,,,35.673327,139.766799,,,(03)5579-5031,,,,,,1040061,,,,,,,,,���e�O��;���e�畆��;�畆��;�`���O��,,,,,,,
131024,1.31025E+11,������,��Ö@�l�Вc��i�� ������c�N���j�b�N,,,��ʐf�Ï�,131024,,�����s���������񒚖�6-12��q�{��11�K,,,,,,35.673226,139.766715,,,(03)3528-6887,,,,,,1040061,,,,,,,,,����,,,,,,,