�S���n�������c�̃R�[�h,�@�l�ԍ�,ID,�n�������c�̖�,�C�x���g��,����R�[�h,�C�x���g�ʏ�,�T�u�^�C�g��,�C�x���g��_�J�i,�C�x���g��_�p��,�R���e���cURL,���,�L�[���[�h,�^�O,�ΏۂƂȂ�Y��,�J�Ãp�^�[��,�J�n��,�I����,�J�n����,�I������,�J�n�������L����,���v����,�f�ڊJ�n��,�f�ڏI����,�T�v,����,�T�u�C�x���g,�C�x���g���,����(��{),����(�ڍ�),�A���於��,�A����d�b�ԍ�,�A��������ԍ�,��Î�,���Òc��,�֘A�g�D,�Ώێ�,�ΏێҔ��l,�ꏊ����,�W���i��t�j�ꏊ,���ݒn_�S���n�������c�̃R�[�h,����ID,���ݒn_�A���\�L,���ݒn_�s���{��,���ݒn_�s�撬��,���ݒn_����,���ݒn_�Ԓn�ȉ�,��������(����),�ܓx,�o�x,�A�N�Z�X���@,���ԏ���,���ԏꗿ��,���֏���,Web�J��,Web�J��URL,�c�[���E��,���,������l,�������,���ώ��,�O����Ή�,�O����Ή����l,�J�Ï���,�Q���\���I����,�Q���\���I������,�Q���\�����@,�\���J�n��,�\���J�n����,�\��URL,URL,������,���ނւ��R�[�i�[,���H��,�x�r�[�J�[�ݏo,�x�r�[�J�[���p,�摜,�摜_���C�Z���X,���l
131024,,,������,��30�񏭔N�����X�|�[�c�t�F�X�e�B�o��,,,,,,,,,,,,2022/4/17,2022/4/17,,,,,,,,,,,,,,,,,,,,,����������,,,,�����s������z�n7-9-11,,,,,,,,,,,,,,,,,,,,,,,,,,,,,,,,,,,,
131024,,,������,��33��t�@�~���[�X�|�[�c�f�[,,,,,,,,,,,,2022/5/3,2022/5/3,,,,,,,,,,,,,,,,,,,,,�����X�|�[�c�Z���^�[,,,,�����s��������{���l��2-59-1�@�l��������,,,,,,,,,,,,,,,,,,,,,,,,,,,,,,,,,,,,
131024,,,������,��19��G�R�܂�,,,,,,,,,,,,2022/6/5,2022/6/5,,,,,,,,,,,,,,,,,,,,,����������,,,,�����s������z�n7-9-11,,,,,,,,,,,,,,,,,,,,,,,,,,,,,,,,,,,,
131024,,,������,��20�񒆉���u�[�P�Ղ�,,,,,,,,,,,,2022/6/24,2022/6/25,,,,,,,,,,,,,,,,,,,,,�����Z���^�[�u�u�[�P21�v,,,,�����s������z�n��1-1-1,,,,,,,,,,,,,,,,,,,,,,,,,,,,,,,,,,,,
131024,,,������,��4�񓌋����ۍ����R���N�[��in HARUMI,,,,,,,,,,,,2022/7/29,2022/7/31,,,,,,,,,,,,,,,,,,,,,��ꐶ���z�[��,,,,�����s�����搰�C1-8-9 ���C�g���g���X�N�G�A��,,,,,,,,,,,,,,,,,,,,,,,,,,,,,,,,,,,,
131024,,,������,��32�񒆉����]�˂܂�~���ǂ���,,,,,,,,,,,,2022/8/26,2022/8/27,,,,,,,,,,,,,,,,,,,,,�l������,,,,�����s��������{���l��2-59-1,,,,,,,,,,,,,,,,,,,,,,,,,,,,,,,,,,,,
131024,,,������,�����摍���h�ЌP��,,,,,,,,,,,,2022/9/4,2022/9/4,,,,,,,,,,,,,,,,,,,,,�����������ق�,,,,�����s������z�n7-9-11�ق�,,,,,,,,,,,,,,,,,,,,,,,,,,,,,,,,,,,,
131024,,,������,�h�V���,,,,,,,,,,,,2022�N9��8���E9���A13�`15��,,,,,,,,,,,,,,,,,,,,,,�̕����,,,,�����s��������4-12-15,,,,,,,,,,,,,,,,,,,,,,,,,,,,,,,,,,,,
131024,,,������,��70�񒆉���ό����Ƃ܂�,,,,,,,,,,,,2022/10/3,11����{,,,,,,,,,,,,,,,,,,,,,�����~,,,,,,,,,,,,,,,,,,,,,,,,,,,,,,,,,,,,,,,,
131024,,,������,��34��u�斯�X�|�[�c�̓��v,,,,,,,,,,,,2022/10/10,2022/10/10,,,,,,,,,,,,,,,,,,,,,�����^����ق�,,,,,,,,,,,,,,,,,,,,,,,,,,,,,,,,,,,,,,,,
131024,,,������,��43�񒆉���q�ǂ��t�F�X�e�B�o��,,,,,,,,,,,,2022/10/16,2022/10/16,,,,,,,,,,,,,,,,,,,,,�l���^����ق�,,,,�����s��������{���l��2-59-1�ق�,,,,,,,,,,,,,,,,,,,,,,,,,,,,,,,,,,,,
131024,,,������,���N�����܂�,,,,,,,,,,,,2022/10/23,2022/10/23,,,,,,,,,,,,,,,,,,,,,�����������A�����Z���^�[�ق�,,,,�����s������z�n7-9-11�ق�,,,,,,,,,,,,,,,,,,,,,,,,,,,,,,,,,,,,
131024,,,������,�����܂�^�� ���Ə��̑咆����W,,,,,,,,,,,,2022/10/26,2022/10/31,,,,,,,,,,,,,,,,,,,,,���{���O�z�{�X,,,,�����s��������{������1-4-1,,,,,,,,,,,,,,,,,,,,,,,,,,,,,,,,,,,,
131024,,,������,������܂邲�ƃ~���[�W�A��2022,,,,,,,,,,,,2022/11/13,2022/11/13,,,,,,,,,,,,,,,,,,,,,,,,,,,,,,,,,,,,,,,,,,,,,,,,,,,,,,,,,,,,,
131024,,,������,��21�񒆉���Y�ƕ����W�i�ւ��W�j,,,,,,,,,,,,2022/11/13,2022/11/15,,,,,,,,,,,,,,,,,,,,,���C�g���g���X�N�G�A,,,,�����s�����搰�C1-8-16,,,,,,,,,,,,,,,,,,,,,,,,,,,,,,,,,,,,
131024,,,������,��67��V�N���ǂ��H�������,,,,,,,,,,,,2023/1/14,2023/1/14,,,,,,,,,,,,,,,,,,,,,�����X�|�[�c�Z���^�[,,,,�����s��������{���l��2-59-1�@�l��������,,,,,,,,,,,,,,,,,,,,,,,,,,,,,,,,,,,,
131024,,,������,��\�΂̂ǂ�,,,,,,,,,,,,2023/1/9,2023/1/9,,,,,,,,,,,,,,,,,,,,,���C�����p�[�N�z�e��,,,,�����s��������{���a�k��2-1-1,,,,,,,,,,,,,,,,,,,,,,,,,,,,,,,,,,,,
131024,,,������,��22�񒆉����܂�,,,,,,,,,,,,2023/2/1,2023/2/1,,,,,,,,,,,,,,,,,,,,,����������,,,,�����s������z�n7-9-11,,,,,,,,,,,,,,,,,,,,,,,,,,,,,,,,,,,,
131024,,,������,��35�񕽘a�̓s�s�̊y�����W��,,,,,,,,,,,,2023�N3��15���܂��͒��߂̓y�j��,2023�N3��15���܂��͒��߂̓y�j��,,,,,,,,,,,,,,,,,,,,,������فu����u���b�T���v,,,,�����s��������2-15-6,,,,,,,,,,,,,,,,,,,,,,,,,,,,,,,,,,,,
